﻿Group,Age,Sex,Lives_alone,Handedness,Years_of_education,BMI,NART_IQ,MMSE_total,SF36,MADRS_total,GDS_total,DSSI_total_social_support,IADL_total,LSNS_R_Total,UCLA-LS_total,RAVLT_total_A1_to_A5,RAVLT_recall_max,Verbal_Fluency_total,RBMT_screen_total,RBMT_SPS_total,DSST_total_time,TMT_A_time_sec,TMT_B_time_sec,Digit_span_forward,Digit_span_backward,SWM_between_errors_4_to_10_boxes,SWM_within_errors_4_to_10_boxes,SS_span_length,SS_total_errors,PAL_stages_completed,PAL_total_errors_adjusted,AGN_median_correct_latency,FERT_proportion,WAM_physical_activity,WAM_entropy,WAM_jerk,probability_speech_avg7days,percent_speech_24hrs_avg7days,percent_speech_0600-1200_avg7days,percentage_speech_1200-1800_avg7days,percentage_speech_1800-0000_avg7days,percent_wearer_speech_avg7days
control,77,male,no,right,17,22.2,128,30,85.83,0,1,49,8,41,9,46,11,53,,,173,29,61,7,8,,,,,,,,,0.16704,2.13100,0.00098,0.27009,0.06677,0.12183,0.14048,0.00437,0.08725
control,75,female,no,right,11,25.6,105,29,63.47,0,1,50,8,37,5,47,12,41,11,22,171,26,88,5,4,,,,,,,,,0.14736,2.35230,0.00105,0.29117,0.13115,0.19484,0.26746,0.05913,0.11503
control,84,female,no,right,16,20.3,117,27,57.08,1,3,53,8,46,7,36,9,55,10,21,221,67,155,9,5,53,5,5,14,8,17,614,0.55,0.18567,2.76540,0.00133,0.31195,0.12133,0.25635,0.20397,0.02183,0.10547
control,61,female,no,right,14,25.2,117,27,88.47,2,0,50,8,35,1,53,14,58,11,22,155,40,71,6,6,,,,,,,,0.65,0.18707,2.61850,0.00139,0.31193,0.15982,0.26230,0.29722,0.07738,0.12000
control,79,male,no,right,10,25.3,118,29,66.25,2,0,50,8,41,7,37,10,50,7,17,,41,73,8,5,69,2,5,12,8,38,506.5,0.54,0.22071,2.97320,0.00174,0.32583,0.17470,0.28492,0.32222,0.08571,0.13510
control,76,female,no,right,14,28.7,118,29,73.06,0,1,52,8,43,2,51,13,36,,,232,62,149,7,8,,,,,,,,0.35,0.19790,2.82430,0.00147,0.32191,0.13899,0.26746,0.25278,0.03333,0.11029
control,79,female,yes,right,14,24.1,122,29,81.39,3,0,42,8,38,6,38,9,51,11,22,150,26,91,11,9,27,2,4,6,7,32,560,0.51,0.22576,2.97470,0.00170,0.31949,0.15605,0.30556,0.29008,0.02619,0.12774
control,68,female,no,right,12,18.7,117,29,74.31,6,6,37,8,22,18,51,11,43,,,,24,59,8,5,44,6,6,16,8,22,473,0.62,0.19556,2.85410,0.00170,0.28019,0.10605,0.18175,0.20397,0.03770,0.10765
control,82,female,no,right,17,25,123,30,77.22,2,2,47,8,22,11,51,13,52,6,17,149,35,70,9,7,15,0,5,7,8,28,578.5,0.39,0.16425,2.46830,0.00110,0.31333,0.13185,0.27976,0.21944,0.02540,0.10761
control,72,female,yes,right,12,25.6,113,29,89.86,0,0,55,8,40,0,46,11,58,6,14,137,29,55,9,6,46,1,5,11,8,23,543,0.37,0.24448,2.98480,0.00170,0.31047,0.11607,0.21429,0.21865,0.03016,0.11453
control,78,male,yes,right,12,24.1,94,25,70.42,4,0,24,8,20,14,28,8,22,,,,44,99,8,4,,,,,,,,0.26,0.20770,2.96040,0.00163,0.30560,0.11984,0.23294,0.21706,0.02698,0.11364
control,78,female,yes,right,10,23.4,95,29,82.22,0,0,52,8,37,8,33,8,28,,,304,44,152,8,5,39,1,5,13,7,47,691.5,,0.19346,2.86150,0.00144,0.28258,0.09663,0.15159,0.21548,0.01825,0.10725
control,65,female,no,right,10,22.5,106,30,90.56,0,0,49,8,33,6,46,12,49,,,169,27,67,8,4,47,1,4,6,8,29,506.5,0.39,0.20926,2.94110,0.00147,0.31329,0.15099,0.26270,0.30278,0.03651,0.12577
control,68,female,yes,right,13,24.8,103,29,69.17,2,2,45,8,38,0,51,14,34,4,14,245,25,63,9,5,62,4,3,4,8,40,522.5,,0.22373,3.11490,0.00193,0.30990,0.11796,0.21111,0.20357,0.05437,0.10953
control,73,male,no,right,10,34.1,108,29,79.86,0,2,50,8,49,9,44,11,71,11,21,150,,,11,5,34,0,7,21,8,22,571,,0.17335,3.02950,0.00145,0.30902,0.11429,0.23413,0.18571,0.03571,0.09784
control,70,male,no,right,11,32.3,118,29,87.78,0,0,47,8,44,0,44,11,36,9,20,273,64,109,11,8,19,0,4,6,8,21,607.5,0.38,0.16898,2.48010,0.00106,0.31131,0.10952,0.19405,0.20952,0.03254,0.10971
control,67,female,no,right,19,29.1,123,29,70.97,0,0,53,8,39,1,53,12,36,8,18,144,23,49,8,9,,,,,,,,0.62,0.14623,2.42260,0.00098,0.29809,0.10248,0.19802,0.19841,0.01151,0.09967
control,74,female,no,right,15,26.8,124,29,72.92,0,0,53,8,44,0,59,14,63,10,22,188,43,73,9,7,33,2,4,7,8,18,605,0.54,0.20306,2.89350,0.00155,0.32350,0.14345,0.28810,0.24484,0.03849,0.11904
control,74,female,yes,left,9,25.8,91,29,92.22,0,0,51,8,38,5,33,8,29,6,15,216,28,82,10,8,69,3,4,8,8,33,596,0.43,0.22925,3.18590,0.00181,0.32173,0.17530,0.33135,0.32262,0.04524,0.13433
control,68,female,no,right,11,30.2,111,29,76.11,0,2,52,8,46,7,44,12,60,,,160,43,70,8,9,31,1,5,10,6,117,530.5,0.4,0.18106,2.71310,0.00124,0.30885,0.13363,0.24841,0.25318,0.03135,0.11232
control,72,female,yes,right,19,24.3,120,30,90.42,0,0,55,8,36,9,58,14,86,,,148,30,46,7,6,14,0,6,12,8,23,459,,0.21665,2.91830,0.00153,0.30940,0.13661,0.22103,0.27540,0.04564,0.11604
control,69,female,no,right,17,23.5,128,30,93.89,0,0,55,8,39,1,46,12,61,8,17,150,34,52,10,9,48,3,5,7,7,60,575.5,0.57,0.23460,3.00960,0.00159,0.32141,0.15228,0.28611,0.25357,0.06746,0.12631
control,76,female,yes,right,10,22.7,113,29,90.28,0,0,50,8,37,3,49,13,44,,,172,50,84,8,5,25,6,5,16,8,28,540,0.56,0.20437,2.86900,0.00152,0.29709,0.11458,0.23175,0.20159,0.02341,0.08946
control,68,male,no,right,20,31.8,129,27,83.47,0,1,49,8,25,3,31,7,76,,,147,28,64,12,9,,,,,,,,0.54,0.22848,3.23450,0.00178,0.31202,0.16696,0.26587,0.31429,0.08214,0.12533
control,84,female,yes,right,17,30.1,121,29,61.39,2,0,50,7,38,0,45,11,53,5,16,234,38,150,8,6,62,7,4,9,8,13,589.5,0.49,0.15932,2.60980,0.00111,0.31440,0.15893,0.31508,0.27500,0.04365,0.12100
control,73,female,no,right,16,30.1,126,29,75.28,4,1,50,8,36,9,54,12,56,11,22,219,30,73,8,5,24,3,5,13,8,8,566,0.46,0.21503,2.83450,0.00155,0.30965,0.15427,0.28373,0.26468,0.06468,0.11628
control,75,male,yes,right,12,27.4,107,28,89.72,0,0,50,8,44,7,41,10,61,8,18,207,40,132,5,5,45,14,5,13,8,6,531,0.52,0.21116,2.63920,0.00143,0.31334,0.14722,0.29127,0.23889,0.05635,0.11825
control,85,female,yes,right,10,23.6,110,29,84.72,0,0,41,8,29,11,52,13,57,8,18,199,30,72,7,6,57,27,5,12,8,12,611.5,0.62,0.20602,2.94560,0.00157,0.30618,0.10982,0.21429,0.20198,0.02183,0.11208
control,76,female,no,right,10,32.9,107,30,63.61,1,3,43,8,31,9,42,12,34,5,16,227,35,89,5,5,5,0,6,17,8,17,703,0.55,0.19842,3.00870,0.00171,0.30811,0.14980,0.24127,0.28135,0.07262,0.11765
LLD,76,male,yes,right,10,27.7,106,26,87.08,9,2,43,7,21,2,33,11,38,8,22,218,52,86,10,7,39,0,4,6,7,61,506,0.55,0.16038,2.56940,0.00113,0.22864,0.01379,0.03452,0.01627,0.00397,0.02683
LLD,74,female,no,right,10,55.4,118,28,4.72,43,10,39,1,19,18,37,9,25,9,18,275,60,96,8,6,22,2,5,9,0,218,546.5,0.52,0.10548,1.50350,0.00052,0.22418,0.01260,0.03611,0.01389,0.00000,0.02654
LLD,79,female,yes,right,11,38.5,113,28,18.61,31,12,47,5,28,26,46,13,39,7,16,465,178,457,6,9,66,14,5,15,7,37,610,0.51,0.13410,2.12430,0.00080,0.22781,0.01607,0.04365,0.01905,0.00040,0.02292
LLD,81,female,no,right,3,,95,26,21.81,26,12,47,3,18,13,36,12,25,,,,86,114,4,3,68,10,5,13,7,79,,,0.16372,2.22560,0.00101,0.22536,0.01260,0.02738,0.01548,0.00754,0.02646
LLD,68,female,no,right,12,23.1,116,25,56.25,36,10,49,8,35,18,54,14,36,8,18,215,57,95,8,4,47,6,5,13,8,17,537,0.61,0.18787,2.51210,0.00128,0.21777,0.00992,0.01944,0.01587,0.00318,0.02435
LLD,76,female,yes,right,10,32.9,95,27,27.92,24,12,44,6,26,21,34,9,33,,,,76,250,2,2,74,0,4,7,7,68,530,,0.20470,3.09310,0.00142,0.24513,0.01528,0.01587,0.03294,0.01230,0.02914
LLD,71,female,no,right,11,37,110,30,28.89,30,11,40,8,28,23,40,9,37,8,23,154,41,71,7,7,11,1,4,8,8,11,636,,0.15836,2.49810,0.00106,0.25423,0.04226,0.11151,0.05238,0.00516,0.03433
LLD,68,female,yes,right,10,38.3,107,25,14.58,21,8,43,7,36,14,27,7,35,6,17,200,34,99,8,5,56,6,4,6,6,112,578,0.55,0.16961,2.41850,0.00116,0.26193,0.04831,0.08452,0.08810,0.02024,0.03661
LLD,79,female,yes,right,11,32.3,120,29,39.31,27,11,40,8,26,25,43,10,49,,,196,32,70,10,9,33,1,4,5,7,63,611.5,0.55,0.17718,2.64790,0.00124,0.25603,0.01895,0.02302,0.04048,0.01230,0.03380
LLD,80,male,no,right,10,23.6,121,29,41.81,38,10,39,8,34,19,51,14,67,7,16,165,56,121,9,5,73,17,6,26,8,25,664.5,0.49,0.20554,2.59890,0.00141,0.25236,0.02599,0.06310,0.03571,0.00476,0.02869
LLD,68,male,yes,right,11,26,103,27,23.89,33,12,38,8,25,21,40,10,62,7,19,162,32,59,6,7,21,0,5,10,8,25,527,0.43,0.14418,2.37430,0.00093,0.23457,0.02153,0.06468,0.01984,0.00159,0.02866
LLD,76,female,yes,right,12,,111,29,51.39,17,4,48,8,39,7,52,14,20,7,16,224,51,156,4,3,61,13,5,17,8,8,643,0.44,0.20881,3.14010,0.00165,0.23305,0.01458,0.03929,0.01468,0.00397,0.02774
LLD,64,female,yes,mixed,13,32,123,27,31.39,34,11,39,8,19,26,48,13,41,9,19,262,75,73,10,7,46,8,4,11,8,18,551,0.56,0.08853,1.65850,0.00036,0.24207,0.02143,0.05198,0.03016,0.00357,0.02818
LLD,64,male,yes,right,11,32.7,105,26,49.72,26,11,29,8,12,28,39,10,31,8,20,399,52,167,10,5,50,6,5,17,8,25,603.5,0.4,0.17719,2.59970,0.00119,0.25401,0.02768,0.04127,0.05357,0.01548,0.03005
LLD,81,male,no,right,13,27.1,116,29,55.56,20,5,55,8,38,6,,,,,,,,,5,6,,,,,,,,0.55,0.17496,2.67230,0.00126,0.24396,0.01587,0.02460,0.02778,0.01071,0.02944
LLD,81,female,yes,right,10,30.7,103,29,48.75,26,8,47,6,26,17,37,9,,5,13,,110,599,7,4,,,,,8,72,,0.37,0.19849,2.71880,0.00126,0.22907,0.01379,0.01270,0.03016,0.01230,0.02716
LLD,72,female,yes,right,10,24.6,95,26,18.19,,,36,6,10,12,32,7,23,1,4,705,,,6,5,72,2,5,19,7,79,571,,0.22053,2.85760,0.00159,0.23054,0.01617,0.04603,0.01468,0.00397,0.02607
LLD,82,female,yes,right,9,28.1,100,26,49.31,28,11,43,6,27,23,43,12,35,,,440,53,247,5,3,54,2,5,21,6,137,555,0.3,0.14697,2.22110,0.00084,0.24251,0.01627,0.03254,0.02778,0.00476,0.03124
LLD,69,male,no,right,13,34.3,117,30,36.81,41,14,43,6,37,20,32,7,58,1,3,,49,145,4,5,28,0,5,7,8,16,580,0.51,0.14801,2.26790,0.00114,0.24196,0.03145,0.06627,0.05040,0.00913,0.03231
LLD,86,female,yes,right,15,23.7,124,26,37.22,24,7,48,7,29,21,53,13,52,1,3,243,41,172,8,4,69,1,4,12,6,126,592.5,,0.15304,2.16710,0.00099,0.25014,0.01379,0.00595,0.03532,0.01389,0.03008
LLD,84,female,yes,right,13,26.2,117,29,47.5,30,12,36,8,22,29,37,9,52,7,16,243,44,57,9,8,3,2,7,20,8,42,576,0.51,0.17831,2.74080,0.00138,0.23212,0.01379,0.03611,0.01825,0.00040,0.02502
LLD,73,male,yes,right,10,23.9,105,24,81.11,10,3,35,8,12,8,43,13,18,3,11,262,33,53,8,3,51,3,4,15,6,121,414,,0.21411,3.20490,0.00169,0.24396,0.02143,0.05913,0.02659,0.00000,0.02654
LLD,75,female,no,right,11,31.2,103,25,37.64,39,11,39,7,22,18,36,9,35,,,207,45,186,9,2,71,6,3,7,8,63,552,0.5,0.15967,2.63250,0.00118,0.24341,0.03006,0.06429,0.05000,0.00595,0.03407
LLD,67,female,yes,right,10,30.1,97,28,13.89,32,13,36,8,22,27,30,8,49,,,222,49,110,8,8,76,24,4,7,7,66,501,0.38,0.22972,2.96490,0.00175,0.22289,0.01280,0.02143,0.02183,0.00794,0.02818
LLD,75,female,no,right,10,32.5,118,30,70.83,17,9,41,8,21,8,35,9,40,,,208,47,121,8,5,219,177,4,14,6,118,568,0.52,0.14924,2.12240,0.00084,0.22579,0.01617,0.04405,0.01389,0.00556,0.02471
LLD,71,female,no,right,10,27.9,97,30,22.36,30,7,40,8,23,21,35,9,39,,,177,40,135,6,3,50,5,6,14,8,20,569,0.33,0.17981,2.86890,0.00134,0.26725,0.03026,0.06667,0.04564,0.00794,0.03091
LLD,70,male,no,right,16,24.2,124,29,43.75,32,13,42,7,29,23,34,10,37,,,,48,110,7,6,39,0,5,10,8,17,575.5,0.52,0.17464,2.37590,0.00101,0.24844,0.01816,0.03492,0.03056,0.00714,0.02967
LLD,72,female,no,right,13,32,111,30,33.75,30,9,44,8,27,14,47,11,32,6,16,195,59,149,6,4,55,12,5,11,8,36,588,0.45,0.14325,2.24080,0.00091,0.23452,0.02173,0.05397,0.02937,0.00318,0.02772
LLD,69,female,yes,right,10,36.9,91,29,16.39,39,13,40,5,28,28,26,7,13,4,12,261,37,150,5,4,35,1,4,5,8,40,654,,0.16155,2.56480,0.00104,0.23366,0.01419,0.03175,0.02064,0.00397,0.02660
,,,,,,,,,,,,,,,,,,,,,,,,,,,,,,,,,,,,,,,,,,
,,,,,,,,,,,,,,,,,,,,,,,,,,,,,,,,,,,,,,,,,,
